Target
Gastrin/cholecystokinin type B receptor
Ligand
BDBM50033632
Substrate
Meas. Tech.
ChEMBL_47966 (CHEMBL653980)
IC50
1150±n/a nM
Citation
 Amblard, MRodriguez, MLignon, MFGalas, MCBernad, NArtis-Noël, AMHauad, LLaur, JCalifano, JCAumelas, A Synthesis and biological evaluation of cholecystokinin analogs in which the Asp-Phe-NH2 moiety has been replaced by a 3-amino-7-phenylheptanoic acid or a 3-amino-6-(phenyloxy)hexanoic acid. J Med Chem 36:3021-8 (1993)  
Target
Name:
Gastrin/cholecystokinin type B receptor
Synonyms:
CCK-2 receptor CCK-BR CCKRB Cholecystokinin receptor GASR_HUMAN | Gastrin/cholecystokinin type B receptor
Type:
G Protein-Coupled Receptor (GPCR)
Mol. Mass.:
48445.79
Organism:
Homo sapiens (Human)
Description:
Stable expression of human CCK-2 receptors in HEK 293 cells.
Residue:
447
  
Inhibitor
Name:
BDBM50033632
Synonyms:
3-{2-[2-(2-{2-[2-tert-Butoxycarbonylamino-3-(4-sulfo-phenyl)-propionylamino]-hexanoylamino}-acetylamino)-3-(1H-indol-3-yl)-propionylamino]-hexanoylamino}-7-phenyl-heptanoic acid CHEMBL444113
Type:
Small organic molecule
Emp. Form.:
C52H71N7O12S
Mol. Mass.:
1018.225
SMILES:
CCCC[C@H](NC(=O)[C@H](Cc1ccc(cc1)S(O)(=O)=O)NC(=O)OC(C)(C)C)C(=O)NCC(=O)N[C@H](Cc1c[nH]c2ccccc12)C(=O)N[C@@H](CCCC)C(=O)NC(CCCCc1ccccc1)CC(O)=O
: