Target
Purine nucleoside phosphorylase
Ligand
BDBM50033662
Substrate
Meas. Tech.
ChEMBL_162189 (CHEMBL766709)
Ki
1400±n/a nM
Citation
 Kelley, JLMcLean, EWCrouch, RCAverett, DRTuttle, JV [[(Guaninylalkyl)phosphinico]methyl]phosphonic acids. Multisubstrate analogue inhibitors of human erythrocyte purine nucleoside phosphorylase. J Med Chem 38:1005-14 (1995)  
Target
Name:
Purine nucleoside phosphorylase
Synonyms:
Inosine phosphorylase NP PNPH_HUMAN | Purine nucleoside phosphorylase (PNPase)
Type:
Enzyme
Mol. Mass.:
32119.53
Organism:
Homo sapiens (Human)
Description:
Residue:
289
  
Inhibitor
Name:
BDBM50033662
Synonyms:
CHEMBL7194 | {Hydroxy-[5-(2-hydroxy-6-oxo-1,6-dihydro-purin-9-yl)-pentyl]-phosphinoylmethyl}-phosphonic acid
Type:
Small organic molecule
Emp. Form.:
C11H18N4O7P2
Mol. Mass.:
380.2307
SMILES:
OP(O)(=O)CP(O)(=O)CCCCCn1cnc2c1[nH]c(=O)[nH]c2=O
: