Target
Peroxisome proliferator-activated receptor alpha
Ligand
BDBM50150484
Substrate
Meas. Tech.
ChEMBL_933251 (CHEMBL3069175)
IC50
600±n/a nM
Citation
  TBA Med Chem Res 22:3126-3133 (2013)    Article 
Target
Name:
Peroxisome proliferator-activated receptor alpha
Synonyms:
NR1C1 PPAR PPAR-alpha PPARA_HUMAN Peroxisome proliferator-activated receptor | Peroxisome proliferator-activated receptor alpha (PPAR alpha)
Type:
Enzyme
Mol. Mass.:
52222.08
Organism:
Homo sapiens (Human)
Description:
Q07869
Residue:
468
  
Inhibitor
Name:
BDBM50150484
Synonyms:
(Z)-9-octadecenoic acid CHEMBL8659 Octadec-9-enoic acid oleicacid
Type:
Small organic molecule
Emp. Form.:
C18H34O2
Mol. Mass.:
282.4614
SMILES:
CCCCCCCC\C=C/CCCCCCCC(O)=O
: