Target
Peroxisome proliferator-activated receptor gamma
Ligand
BDBM50150484
Substrate
Meas. Tech.
ChEMBL_933250 (CHEMBL3069174)
IC50
4100±n/a nM
Citation
  TBA Med Chem Res 22:3126-3133 (2013)    Article 
Target
Name:
Peroxisome proliferator-activated receptor gamma
Synonyms:
NR1C3 PPAR-gamma PPARG_HUMAN Peroxisome proliferator-activated receptor gamma (PPAR gamma) Peroxisome proliferator-activated receptor gamma (PPARĪ³) peroxisome proliferator-activated receptor gamma isoform 2
Type:
Nuclear Receptor
Mol. Mass.:
57613.46
Organism:
Homo sapiens (Human)
Description:
P37231
Residue:
505
  
Inhibitor
Name:
BDBM50150484
Synonyms:
(Z)-9-octadecenoic acid CHEMBL8659 Octadec-9-enoic acid oleicacid
Type:
Small organic molecule
Emp. Form.:
C18H34O2
Mol. Mass.:
282.4614
SMILES:
CCCCCCCC\C=C/CCCCCCCC(O)=O
: