Target
5-hydroxytryptamine receptor 1A
Ligand
BDBM50034342
Substrate
Meas. Tech.
ChEMBL_589 (CHEMBL615459)
Ki
3±n/a nM
Citation
 Jain, ANHarris, NLPark, JY Quantitative binding site model generation: compass applied to multiple chemotypes targeting the 5-HT1A receptor. J Med Chem 38:1295-308 (1995)  
Target
Name:
5-hydroxytryptamine receptor 1A
Synonyms:
5-HT-1A 5-hydroxytryptamine receptor 1A (5-HT-1A) ADRB2RL1 Dopamine D2 receptor and serotonin 1a receptor HTR1A | Serotonin receptor 1A
Type:
Mol. Mass.:
46122.49
Organism:
Homo sapiens (Human)
Description:
Residue:
422
  
Inhibitor
Name:
BDBM50034342
Synonyms:
(3aR,9bS) 3-Propyl-2,3,3a,4,5,9b-hexahydro-1H-benzo[e]indol-9-ol (3aS,9bR) 3-Propyl-2,3,3a,4,5,9b-hexahydro-1H-benzo[e]indol-9-ol CHEMBL430332
Type:
Small organic molecule
Emp. Form.:
C15H21NO
Mol. Mass.:
231.3333
SMILES:
CCCN1CC[C@@H]2[C@H]1CCc1cccc(O)c21
: