Target
Lactoperoxidase
Ligand
BDBM50489038
Substrate
Meas. Tech.
ChEMBL_929729 (CHEMBL3073038)
IC50
34600±n/a nM
Citation
  TBA Med Chem Res 22:4810-4817 (2013)    Article 
Target
Name:
Lactoperoxidase
Synonyms:
LPO PERL_BOVIN
Type:
Enzyme
Mol. Mass.:
80659.97
Organism:
Bos taurus (Bovine)
Description:
P80025
Residue:
712
  
Inhibitor
Name:
BDBM50489038
Synonyms:
CHEMBL2299200
Type:
Small organic molecule
Emp. Form.:
C19H12O2
Mol. Mass.:
272.2974
SMILES:
O=c1oc(cc2ccccc12)-c1cccc2ccccc12
: