Target
Lactoperoxidase
Ligand
BDBM50489043
Substrate
Meas. Tech.
ChEMBL_929729 (CHEMBL3073038)
IC50
6200±n/a nM
Citation
  TBA Med Chem Res 22:4810-4817 (2013)    Article 
Target
Name:
Lactoperoxidase
Synonyms:
LPO PERL_BOVIN
Type:
Enzyme
Mol. Mass.:
80659.97
Organism:
Bos taurus (Bovine)
Description:
P80025
Residue:
712
  
Inhibitor
Name:
BDBM50489043
Synonyms:
CHEMBL2299192
Type:
Small organic molecule
Emp. Form.:
C16H12OS
Mol. Mass.:
252.331
SMILES:
Cc1ccc(cc1)-c1cc2ccccc2c(=S)o1
: