Target
Prothrombin
Ligand
BDBM50034582
Substrate
Meas. Tech.
ChEMBL_208172 (CHEMBL819078)
Ki
0.848±n/a nM
Citation
 Deadman, JJElgendy, SGoodwin, CAGreen, DBaban, JAPatel, GSkordalakes, EChino, NClaeson, GKakkar, VV Characterization of a class of peptide boronates with neutral P1 side chains as highly selective inhibitors of thrombin. J Med Chem 38:1511-22 (1995)  
Target
Name:
Prothrombin
Synonyms:
Activation peptide fragment 1 Coagulation factor II Prothrombin precursor Thrombin heavy chain | Thrombin light chain
Type:
Protein
Mol. Mass.:
70029.57
Organism:
Homo sapiens (Human)
Description:
P00734
Residue:
622
  
Inhibitor
Name:
BDBM50034582
Synonyms:
CHEMBL2448441 | Peptide boronate
Type:
Small organic molecule
Emp. Form.:
C37H51BBrN5O6S
Mol. Mass.:
784.611
SMILES:
Br.[H][C@@]12CC3CC(C3(C)C)[C@]1(C)OB(O2)C(CCC\C(S)=N\N)NC(=O)[C@@H]1CCCN1C(=O)[C@H](Cc1ccccc1)NC(=O)OCc1ccccc1
: