Target
DNA gyrase subunit B
Ligand
BDBM21690
Substrate
Meas. Tech.
ChEMBL_945576 (CHEMBL2344503)
IC50
18100±n/a nM
Citation
 Gomez, CPonien, PSerradji, NLamouri, APantel, ACapton, EJarlier, VAnquetin, GAubry, A Synthesis of gatifloxacin derivatives and their biological activities against Mycobacterium leprae and Mycobacterium tuberculosis. Bioorg Med Chem 21:948-56 (2013)  
Target
Name:
DNA gyrase subunit B
Synonyms:
5.6.2.2 GYRB_MYCTU | gyrB
Type:
PROTEIN
Mol. Mass.:
74087.83
Organism:
Mycobacterium tuberculosis (strain ATCC 25618 / H37Rv)
Description:
ChEMBL_109655
Residue:
675
  
Inhibitor
Name:
BDBM21690
Synonyms:
1-cyclopropyl-6-fluoro-4-oxo-7-(piperazin-1-yl)-1,4-dihydroquinoline-3-carboxylic acid Bay 09867 Ciprinol Ciprofloxacin US9138393, Ciprofloxacin HCl | US9144538, Ciprofloxacin HCl
Type:
Small organic molecule
Emp. Form.:
C17H18FN3O3
Mol. Mass.:
331.3415
SMILES:
OC(=O)c1cn(C2CC2)c2cc(N3CCNCC3)c(F)cc2c1=O
: