Target
Sodium-dependent dopamine transporter
Ligand
BDBM35226
Substrate
Meas. Tech.
ChEMBL_943620 (CHEMBL2343887)
Ki
19953±n/a nM
Citation
 Van Orden, LJVan Dyke, PMSaito, DRChurch, TJChang, RSmith, JAMartin, WJJaw-Tsai, SStangeland, EL A novel class of 3-(phenoxy-phenyl-methyl)-pyrrolidines as potent and balanced norepinephrine and serotonin reuptake inhibitors: synthesis and structure-activity relationships. Bioorg Med Chem Lett 23:1456-61 (2013)  
Target
Name:
Sodium-dependent dopamine transporter
Synonyms:
DA transporter DAT1 Dopamine transporter protein (DAT) SC6A3_HUMAN Sodium-dependent dopamine transporter Solute carrier family 6 member 3
Type:
Multi-pass membrane protein
Mol. Mass.:
68497.11
Organism:
Homo sapiens (Human)
Description:
Q01959
Residue:
620
  
Inhibitor
Name:
BDBM35226
Synonyms:
(S,S)-reboxetine Vestra
Type:
Small organic molecule
Emp. Form.:
C19H23NO3
Mol. Mass.:
313.3908
SMILES:
CCOc1ccccc1O[C@H]([C@@H]1CNCCO1)c1ccccc1
: