Target
Sodium-dependent noradrenaline transporter
Ligand
BDBM35226
Substrate
Meas. Tech.
ChEMBL_943623 (CHEMBL2343890)
IC50
2.0±n/a nM
Citation
 Van Orden, LJVan Dyke, PMSaito, DRChurch, TJChang, RSmith, JAMartin, WJJaw-Tsai, SStangeland, EL A novel class of 3-(phenoxy-phenyl-methyl)-pyrrolidines as potent and balanced norepinephrine and serotonin reuptake inhibitors: synthesis and structure-activity relationships. Bioorg Med Chem Lett 23:1456-61 (2013)  
Target
Name:
Sodium-dependent noradrenaline transporter
Synonyms:
Monoamine transporter NET Noradrenaline Transporter (NET) Norepinephrine transporter protein (NET) SLC6A2 Sodium-dependent noradrenaline transporter (NET) | Solute carrier family 6 member 2
Type:
Multi-pass membrane protein
Mol. Mass.:
69337.72
Organism:
Homo sapiens (Human)
Description:
P23975
Residue:
617
  
Inhibitor
Name:
BDBM35226
Synonyms:
(S,S)-reboxetine Vestra
Type:
Small organic molecule
Emp. Form.:
C19H23NO3
Mol. Mass.:
313.3908
SMILES:
CCOc1ccccc1O[C@H]([C@@H]1CNCCO1)c1ccccc1
: