Target
Muscarinic acetylcholine receptor M3
Ligand
BDBM50035278
Substrate
Meas. Tech.
ChEMBL_138582 (CHEMBL746366)
EC50
500±n/a nM
Citation
 Bräuner-Osborne, HEbert, BBrann, MRFalch, EKrogsgaard-Larsen, P Annulated heterocyclic bioisosteres of norarecoline. Synthesis and molecular pharmacology at five recombinant human muscarinic acetylcholine receptors. J Med Chem 38:2188-95 (1995)  
Target
Name:
Muscarinic acetylcholine receptor M3
Synonyms:
ACM3_HUMAN Cholinergic, muscarinic M3 Muscarinic receptor M3 | RecName: Full=Muscarinic acetylcholine receptor M3
Type:
Enzyme
Mol. Mass.:
66151.03
Organism:
Homo sapiens (Human)
Description:
P20309
Residue:
590
  
Inhibitor
Name:
BDBM50035278
Synonyms:
3-Ethoxy-5,6,7,8-tetrahydro-4H-isoxazolo[4,5-c]azepine | CHEMBL69305
Type:
Small organic molecule
Emp. Form.:
C9H14N2O2
Mol. Mass.:
182.2197
SMILES:
CCOc1noc2CCCNCc12
: