Target
Kappa-type opioid receptor
Ligand
BDBM50035476
Substrate
Meas. Tech.
ChEMBL_145803 (CHEMBL756070)
IC50
0.000320±n/a nM
Citation
 Chang, ACTakemori, AEOjala, WHGleason, WBPortoghese, PS kappa Opioid receptor selective affinity labels: electrophilic benzeneacetamides as kappa-selective opioid antagonists. J Med Chem 37:4490-8 (1995)  
Target
Name:
Kappa-type opioid receptor
Synonyms:
Kappa Opioid Receptor OPRK1 Opiate Kappa 1 | mu/kappa opioid receptor
Type:
G Protein-Coupled Receptor (GPCR)
Mol. Mass.:
42744.99
Organism:
Cavia porcellus (domestic guinea pig)
Description:
P41144
Residue:
380
  
Inhibitor
Name:
BDBM50035476
Synonyms:
CHEMBL413530 | N-[(S)-1-(3-Amino-phenyl)-2-pyrrolidin-1-yl-ethyl]-2-(3,4-dichloro-phenyl)-N-methyl-acetamide
Type:
Small organic molecule
Emp. Form.:
C21H25Cl2N3O
Mol. Mass.:
406.349
SMILES:
CN([C@H](CN1CCCC1)c1cccc(N)c1)C(=O)Cc1ccc(Cl)c(Cl)c1
: