Target
Peroxisome proliferator-activated receptor alpha
Ligand
BDBM24566
Substrate
Meas. Tech.
ChEMBL_955714 (CHEMBL2379025)
EC50
3460±n/a nM
Citation
 Carrieri, AGiudici, MParente, MDe Rosas, MPiemontese, LFracchiolla, GLaghezza, ATortorella, PCarbonara, GLavecchia, AGilardi, FCrestani, MLoiodice, F Molecular determinants for nuclear receptors selectivity: chemometric analysis, dockings and site-directed mutagenesis of dual peroxisome proliferator-activated receptors ?/? agonists. Eur J Med Chem 63:321-32 (2013)  
Target
Name:
Peroxisome proliferator-activated receptor alpha
Synonyms:
NR1C1 PPAR PPAR-alpha PPARA_HUMAN Peroxisome proliferator-activated receptor | Peroxisome proliferator-activated receptor alpha (PPAR alpha)
Type:
Enzyme
Mol. Mass.:
52222.08
Organism:
Homo sapiens (Human)
Description:
Q07869
Residue:
468
  
Inhibitor
Name:
BDBM24566
Synonyms:
2-({4-chloro-6-[(2,3-dimethylphenyl)amino]pyrimidin-2-yl}sulfanyl)acetic acid JMC515449 Compound 1 Wyeth 14,643
Type:
Small organic molecule
Emp. Form.:
C14H14ClN3O2S
Mol. Mass.:
323.798
SMILES:
Cc1cccc(Nc2cc(Cl)nc(SCC(O)=O)n2)c1C
: