Target
D(1A) dopamine receptor
Ligand
BDBM50010686
Substrate
Meas. Tech.
ChEMBL_58344 (CHEMBL671959)
IC50
7.15±n/a nM
Citation
 Brewster, WKNichols, DEWatts, VJRiggs, RMMottola, DMailman, RB Evaluation of cis- and trans-9- and 11-hydroxy-5,6,6a,7,8,12b-hexahydrobenzo[a]phenanthridines as structurally rigid, selective D1 dopamine receptor ligands. J Med Chem 38:318-27 (1995)  
Target
Name:
D(1A) dopamine receptor
Synonyms:
DOPAMINE D1 Dopamine D1 high Dopamine receptor Dopamine1-like Drd1a
Type:
Enzyme Catalytic Domain
Mol. Mass.:
49429.75
Organism:
RAT
Description:
P18901
Residue:
446
  
Inhibitor
Name:
BDBM50010686
Synonyms:
(6aR,12bS)-10,11-Dihydroxy-5,6,6a,7,8,12b-hexahydro-benzo[a]phenanthridinium 10,11-Dihydroxy-5,6,6a,7,8,12b-hexahydro-benzo[a]phenanthridinium(DHX) CHEMBL25856 | dihydrexidine
Type:
Small organic molecule
Emp. Form.:
C17H17NO2
Mol. Mass.:
267.3224
SMILES:
Oc1cc2CC[C@H]3NCc4ccccc4[C@@H]3c2cc1O
: