Target
Integrin alpha-IIb/beta-3
Ligand
BDBM50036089
Substrate
Meas. Tech.
ChEMBL_30117 (CHEMBL640474)
Ki
2.3±n/a nM
Citation
 Ku, TWMiller, WHBondinell, WEErhard, KFKeenan, RMNichols, AJPeishoff, CESamanen, JMWong, ASHuffman, WF Potent non-peptide fibrinogen receptor antagonists which present an alternative pharmacophore. J Med Chem 38:9-12 (1995)  
Target
Name:
Integrin alpha-IIb/beta-3
Synonyms:
Glycoprotein IIb/IIIa
Type:
Mol. Mass.:
Description:
ASSAY_ID of EBI is 30109
Components:
This complex has 2 components.
Component 1
Name:
Integrin beta-3
Synonyms:
CD_antigen=CD61 GPIIIa ITGB3 Platelet membrane glycoprotein IIIa
Type:
Protein
Mol. Mass.:
87038.91
Organism:
Homo sapiens (Human)
Description:
P05106
Residue:
788
  
Component 2
Name:
Integrin alpha-IIb
Synonyms:
CD_antigen=CD41 GPIIb Glycoprotein IIb ITGA2B Integrin alpha-IIb heavy chain Integrin alpha-IIb light chain, form 2 Integrin alpha-V/beta-3 and alpha-IIb/beta 3 | Platelet membrane glycoprotein IIb
Type:
Protein
Mol. Mass.:
113354.85
Organism:
Homo sapiens (Human)
Description:
P08514
Residue:
1039
  
Inhibitor
Name:
BDBM50036089
Synonyms:
CHEMBL18288 | [8-(4-Carbamimidoyl-phenylcarbamoyl)-3-oxo-4-phenethyl-2,3,4,5-tetrahydro-1H-benzo[e][1,4]diazepin-2-yl]-acetic acid
Type:
Small organic molecule
Emp. Form.:
C27H27N5O4
Mol. Mass.:
485.5344
SMILES:
NC(=N)c1ccc(NC(=O)c2ccc3CN(CCc4ccccc4)C(=O)C(CC(O)=O)Nc3c2)cc1
: