Target
Amine oxidase [flavin-containing] A
Ligand
BDBM50116067
Substrate
Meas. Tech.
ChEMBL_964703 (CHEMBL2394495)
Ki
7900±n/a nM
Citation
 Michalska, KKarpiuk, IKról, MTyski, S Recent development of potent analogues of oxazolidinone antibacterial agents. Bioorg Med Chem 21:577-91 (2013)  
Target
Name:
Amine oxidase [flavin-containing] A
Synonyms:
AOFA_HUMAN MAO-A Monoamine oxidase Monoamine oxidase type A (MAO A) Monoamine oxidase type A (MAOA)
Type:
Protein
Mol. Mass.:
59689.53
Organism:
Homo sapiens (Human)
Description:
P21397
Residue:
527
  
Inhibitor
Name:
BDBM50116067
Synonyms:
(Linezolid)N-[3-(3-Fluoro-4-morpholin-4-yl-phenyl)-2-oxo-oxazolidin-5-ylmethyl]-acetamide (S)-3-(3-Fluoro-4-morpholin-4-yl-phenyl)-5-[(1-hydroxy-ethylamino)-methyl]-oxazolidin-2-one (S)-N-((3-fluoro-4-morpholinophenyl)-2-oxaoxazolidin-5-yl)methyl)acetamide CHEMBL126 Linezoid N-[(R)-3-(3-Fluoro-4-morpholin-4-yl-phenyl)-2-oxo-oxazolidin-5-ylmethyl]-acetamide N-[3-(3-Fluoro-4-morpholin-4-yl-phenyl)-2-oxo-oxazolidin-5-ylmethyl]-acetamide N-{[(5S)-3-(3-fluoro-4-morpholin-4-ylphenyl)-2-oxo-1,3-oxazolidin-5-yl]methyl}acetamide Zyvox | cid_441401
Type:
Small organic molecule
Emp. Form.:
C16H20FN3O4
Mol. Mass.:
337.3461
SMILES:
CC(=O)NC[C@H]1CN(C(=O)O1)c1ccc(N2CCOCC2)c(F)c1
: