Target
D(3) dopamine receptor
Ligand
BDBM50029257
Substrate
Meas. Tech.
ChEMBL_62900 (CHEMBL676139)
Ki
1.8±n/a nM
Citation
 Reitz, ABBennett, DJBlum, PSCodd, EEMaryanoff, CAOrtegon, MERenzi, MJScott, MKShank, RPVaught, JL A new arylpiperazine antipsychotic with high D2/D3/5-HT1A/alpha 1A-adrenergic affinity and a low potential for extrapyramidal effects. J Med Chem 37:1060-2 (1994)  
Target
Name:
D(3) dopamine receptor
Synonyms:
DOPAMINE D3 Dopamine D3 receptor | Drd3
Type:
Protein
Mol. Mass.:
49540.58
Organism:
Rattus norvegicus (Rat)
Description:
P19020
Residue:
446
  
Inhibitor
Name:
BDBM50029257
Synonyms:
(3-((4-(2-isopropoxyphenyl)piperazin-1-yl)methyl)phenyl)(piperidin-1-yl)methanone RWJ-377796 {3-[4-(2-Isopropoxy-phenyl)-piperazin-1-ylmethyl]-phenyl}-piperidin-1-yl-methanone
Type:
Small organic molecule
Emp. Form.:
C26H35N3O2
Mol. Mass.:
421.575
SMILES:
CC(C)Oc1ccccc1N1CCN(Cc2cccc(c2)C(=O)N2CCCCC2)CC1
: