Target
Replicase polyprotein 1ab
Ligand
BDBM23418
Substrate
Meas. Tech.
ChEMBL_964668 (CHEMBL2394460)
Kd
24500±n/a nM
Citation
 Park, JYKim, JHKwon, JMKwon, HJJeong, HJKim, YMKim, DLee, WSRyu, YB Dieckol, a SARS-CoV 3CL(pro) inhibitor, isolated from the edible brown algae Ecklonia cava. Bioorg Med Chem 21:3730-7 (2013)  
Target
Name:
Replicase polyprotein 1ab
Synonyms:
3C-like proteinase 3C-like proteinase (SARS-CoV 3Cpro) 3CLp GFL Guanine-N7 methyltransferase Helicase Leader protein Non-structural protein 10 Non-structural protein 3 Non-structural protein 6 Non-structural protein 8 ORF1ab polyprotein PL2-PRO Pol R1AB_SARS RdRp SARS coronavirus main proteinase nsp1 nsp12 nsp14 nsp16 nsp3 nsp5 nsp7 nsp9 pp1ab | rep
Type:
Protein
Mol. Mass.:
790250.81
Organism:
Human SARS coronavirus (SARS-CoV) (Severe acute respiratory syndrome coronavirus)
Description:
P0C6X7
Residue:
7073
  
Inhibitor
Name:
BDBM23418
Synonyms:
(2S)-5,7-dihydroxy-2-(3-hydroxy-4-methoxyphenyl)-3,4-dihydro-2H-1-benzopyran-4-one Hesperitin
Type:
flavanone
Emp. Form.:
C16H14O6
Mol. Mass.:
302.2788
SMILES:
COc1ccc(cc1O)[C@@H]1CC(=O)c2c(O)cc(O)cc2O1
: