Target
Replicase polyprotein 1ab
Ligand
BDBM50259982
Substrate
Meas. Tech.
ChEMBL_964810 (CHEMBL2395056)
IC50
8800±n/a nM
Citation
 Park, JYKim, JHKwon, JMKwon, HJJeong, HJKim, YMKim, DLee, WSRyu, YB Dieckol, a SARS-CoV 3CL(pro) inhibitor, isolated from the edible brown algae Ecklonia cava. Bioorg Med Chem 21:3730-7 (2013)  
Target
Name:
Replicase polyprotein 1ab
Synonyms:
3C-like proteinase 3C-like proteinase (SARS-CoV 3Cpro) 3CLp GFL Guanine-N7 methyltransferase Helicase Leader protein Non-structural protein 10 Non-structural protein 3 Non-structural protein 6 Non-structural protein 8 ORF1ab polyprotein PL2-PRO Pol R1AB_SARS RdRp SARS coronavirus main proteinase nsp1 nsp12 nsp14 nsp16 nsp3 nsp5 nsp7 nsp9 pp1ab | rep
Type:
Protein
Mol. Mass.:
790250.81
Organism:
Human SARS coronavirus (SARS-CoV) (Severe acute respiratory syndrome coronavirus)
Description:
P0C6X7
Residue:
7073
  
Inhibitor
Name:
BDBM50259982
Synonyms:
CHEMBL471187 eckol
Type:
Small organic molecule
Emp. Form.:
C18H12O9
Mol. Mass.:
372.2825
SMILES:
Oc1cc(O)cc(Oc2c(O)cc(O)c3Oc4cc(O)cc(O)c4Oc23)c1
: