Target
Replicase polyprotein 1ab
Ligand
BDBM50491983
Substrate
Meas. Tech.
ChEMBL_964670 (CHEMBL2394462)
IC50
177100±n/a nM
Citation
 Park, JYKim, JHKwon, JMKwon, HJJeong, HJKim, YMKim, DLee, WSRyu, YB Dieckol, a SARS-CoV 3CL(pro) inhibitor, isolated from the edible brown algae Ecklonia cava. Bioorg Med Chem 21:3730-7 (2013)  
Target
Name:
Replicase polyprotein 1ab
Synonyms:
3C-like proteinase 3C-like proteinase (SARS-CoV 3Cpro) 3CLp GFL Guanine-N7 methyltransferase Helicase Leader protein Non-structural protein 10 Non-structural protein 3 Non-structural protein 6 Non-structural protein 8 ORF1ab polyprotein PL2-PRO Pol R1AB_SARS RdRp SARS coronavirus main proteinase nsp1 nsp12 nsp14 nsp16 nsp3 nsp5 nsp7 nsp9 pp1ab | rep
Type:
Protein
Mol. Mass.:
790250.81
Organism:
Human SARS coronavirus (SARS-CoV) (Severe acute respiratory syndrome coronavirus)
Description:
P0C6X7
Residue:
7073
  
Inhibitor
Name:
BDBM50491983
Synonyms:
CHEBI:65918 | Fucodiphloroethol G
Type:
Small organic molecule
Emp. Form.:
C24H18O12
Mol. Mass.:
498.3925
SMILES:
Oc1cc(O)c(Oc2cc(O)cc(O)c2Oc2cc(O)cc(O)c2-c2c(O)cc(O)cc2O)c(O)c1
: