Target
Beta-2 adrenergic receptor
Ligand
BDBM50036835
Substrate
Meas. Tech.
ChEMBL_37846 (CHEMBL656008)
IC50
977.24±n/a nM
Citation
 Macchia, BBalsamo, ABreschi, MCChiellini, GMacchia, MMartinelli, AMartini, CNardini, CNencetti, SRossello, A The [(methyloxy)imino]methyl moiety as a bioisoster of aryl. A novel class of completely aliphatic beta-adrenergic receptor antagonists. J Med Chem 37:1518-25 (1994)  
Target
Name:
Beta-2 adrenergic receptor
Synonyms:
ADRB2_CAVPO adrenergic Beta2
Type:
Enzyme Catalytic Domain
Mol. Mass.:
46993.24
Organism:
GUINEA PIG
Description:
adrenergic Beta2 ADRB2 GUINEA PIG::Q8K4Z4
Residue:
418
  
Inhibitor
Name:
BDBM50036835
Synonyms:
1-(3,4-Dichloro-phenyl)-2-isopropylamino-ethanol CHEMBL30816 | Dichloroisoproterenol,(+/-)
Type:
Small organic molecule
Emp. Form.:
C11H15Cl2NO
Mol. Mass.:
248.149
SMILES:
CC(C)NCC(O)c1ccc(Cl)c(Cl)c1
: