Target
D(2) dopamine receptor
Ligand
BDBM50036924
Substrate
Meas. Tech.
ChEMBL_61573 (CHEMBL673374)
IC50
500±n/a nM
Citation
 Norman, MHRigdon, GCNavas, FCooper, BR Cyclic benzamides as mixed dopamine D2/serotonin 5-HT2 receptor antagonists: potential atypical antipsychotic agents. J Med Chem 37:2552-63 (1994)  
Target
Name:
D(2) dopamine receptor
Synonyms:
DOPAMINE D2 DOPAMINE D2 Short Dopamine D2 receptor Drd2
Type:
G Protein-Coupled Receptor (GPCR)
Mol. Mass.:
50931.60
Organism:
Rattus norvegicus (rat)
Description:
P61169
Residue:
444
  
Inhibitor
Name:
BDBM50036924
Synonyms:
2-[4-(4-Benzo[d]isothiazol-3-yl-piperazin-1-yl)-butyl]-1,2-dihydro-indazol-3-one | CHEMBL86401
Type:
Small organic molecule
Emp. Form.:
C22H25N5OS
Mol. Mass.:
407.532
SMILES:
O=c1n(CCCCN2CCN(CC2)c2nsc3ccccc23)[nH]c2ccccc12
: