Target
Reverse transcriptase
Ligand
BDBM50492147
Substrate
Meas. Tech.
ChEMBL_968173 (CHEMBL2399276)
IC50
8.2±n/a nM
Citation
 Sturino, CFBousquet, YJames, CADeRoy, PDuplessis, MEdwards, PJHalmos, TMinville, JMorency, LMorin, SThavonekham, BTremblay, MDuan, JRibadeneira, MGarneau, MPelletier, ATremblay, SLamorte, LBethell, RCordingley, MGRajotte, DSimoneau, B Identification of potent and orally bioavailable nucleotide competing reverse transcriptase inhibitors: in vitro and in vivo optimization of a series of benzofurano[3,2-d]pyrimidin-2-one derived inhibitors. Bioorg Med Chem Lett 23:3967-75 (2013)  
Target
Name:
Reverse transcriptase
Synonyms:
Type:
Protein
Mol. Mass.:
29598.37
Organism:
Human immunodeficiency virus 1
Description:
Q9WKE8
Residue:
254
  
Inhibitor
Name:
BDBM50492147
Synonyms:
CHEMBL2397562
Type:
Small organic molecule
Emp. Form.:
C25H26N6O3
Mol. Mass.:
458.5123
SMILES:
CC[C@H]1C[C@H](CCO1)n1c2c3cc(ccc3oc2c(nc1=O)-c1cnn(C)c1)-c1cn(C)cn1
: