Target
Reverse transcriptase
Ligand
BDBM50492150
Substrate
Meas. Tech.
ChEMBL_968173 (CHEMBL2399276)
IC50
6.1±n/a nM
Citation
 Sturino, CFBousquet, YJames, CADeRoy, PDuplessis, MEdwards, PJHalmos, TMinville, JMorency, LMorin, SThavonekham, BTremblay, MDuan, JRibadeneira, MGarneau, MPelletier, ATremblay, SLamorte, LBethell, RCordingley, MGRajotte, DSimoneau, B Identification of potent and orally bioavailable nucleotide competing reverse transcriptase inhibitors: in vitro and in vivo optimization of a series of benzofurano[3,2-d]pyrimidin-2-one derived inhibitors. Bioorg Med Chem Lett 23:3967-75 (2013)  
Target
Name:
Reverse transcriptase
Synonyms:
Type:
Protein
Mol. Mass.:
29598.37
Organism:
Human immunodeficiency virus 1
Description:
Q9WKE8
Residue:
254
  
Inhibitor
Name:
BDBM50492150
Synonyms:
CHEMBL2397559
Type:
Small organic molecule
Emp. Form.:
C25H24N8O3
Mol. Mass.:
484.5099
SMILES:
CC[C@H]1C[C@H](CCO1)n1c2c(oc3cc(C#N)c(nc23)-c2cnn(C)c2)c(nc1=O)-c1cnn(C)c1
: