Target
Reverse transcriptase
Ligand
BDBM50492171
Substrate
Meas. Tech.
ChEMBL_968173 (CHEMBL2399276)
IC50
10.0±n/a nM
Citation
 Sturino, CFBousquet, YJames, CADeRoy, PDuplessis, MEdwards, PJHalmos, TMinville, JMorency, LMorin, SThavonekham, BTremblay, MDuan, JRibadeneira, MGarneau, MPelletier, ATremblay, SLamorte, LBethell, RCordingley, MGRajotte, DSimoneau, B Identification of potent and orally bioavailable nucleotide competing reverse transcriptase inhibitors: in vitro and in vivo optimization of a series of benzofurano[3,2-d]pyrimidin-2-one derived inhibitors. Bioorg Med Chem Lett 23:3967-75 (2013)  
Target
Name:
Reverse transcriptase
Synonyms:
Type:
Protein
Mol. Mass.:
29598.37
Organism:
Human immunodeficiency virus 1
Description:
Q9WKE8
Residue:
254
  
Inhibitor
Name:
BDBM50492171
Synonyms:
CHEMBL2397575
Type:
Small organic molecule
Emp. Form.:
C24H22N6O3
Mol. Mass.:
442.4699
SMILES:
Cn1cc(cn1)-c1cnc2oc3c(nc(=O)n(CCC4CCCO4)c3c2c1)-c1ccncc1
: