Target
Neutrophil elastase
Ligand
BDBM50037098
Substrate
Meas. Tech.
ChEMBL_64139 (CHEMBL675303)
Ki
51±n/a nM
Citation
 Warner, PGreen, RCGomes, BStrimpler, AM Non-peptidic inhibitors of human leukocyte elastase. 1. The design and synthesis of pyridone-containing inhibitors. J Med Chem 37:3090-9 (1994)  
Target
Name:
Neutrophil elastase
Synonyms:
Bone marrow serine protease Coagulation factor X ELANE Elastase HLE Leukocyte elastase Medullasin Neutrophil elastase (HNE) PMN elastase Trypsin
Type:
Enzyme
Mol. Mass.:
28532.38
Organism:
Homo sapiens (Human)
Description:
P08246
Residue:
267
  
Inhibitor
Name:
BDBM50037098
Synonyms:
CHEMBL104032 | N-{5-Benzyl-2-oxo-1-[(3,3,3-trifluoro-1-isopropyl-2-oxo-propylcarbamoyl)-methyl]-1,2-dihydro-pyridin-3-yl}-oxalamide
Type:
Small organic molecule
Emp. Form.:
C22H23F3N4O5
Mol. Mass.:
480.437
SMILES:
CC(C)C(NC(=O)Cn1cc(Cc2ccccc2)cc(NC(=O)C(N)=O)c1=O)C(=O)C(F)(F)F
: