Target
Neutrophil elastase
Ligand
BDBM50037100
Substrate
Meas. Tech.
ChEMBL_64139 (CHEMBL675303)
Ki
12±n/a nM
Citation
 Warner, PGreen, RCGomes, BStrimpler, AM Non-peptidic inhibitors of human leukocyte elastase. 1. The design and synthesis of pyridone-containing inhibitors. J Med Chem 37:3090-9 (1994)  
Target
Name:
Neutrophil elastase
Synonyms:
Bone marrow serine protease Coagulation factor X ELANE Elastase HLE Leukocyte elastase Medullasin Neutrophil elastase (HNE) PMN elastase Trypsin
Type:
Enzyme
Mol. Mass.:
28532.38
Organism:
Homo sapiens (Human)
Description:
P08246
Residue:
267
  
Inhibitor
Name:
BDBM50037100
Synonyms:
2,2-Dimethyl-propionic acid 3-{5-benzyloxycarbonylamino-6-oxo-1-[(3,3,3-trifluoro-1-isopropyl-2-oxo-propylcarbamoyl)-methyl]-1,6-dihydro-pyridin-3-ylmethyl}-phenyl ester | CHEMBL105233
Type:
Small organic molecule
Emp. Form.:
C33H36F3N3O7
Mol. Mass.:
643.65
SMILES:
CC(C)C(NC(=O)Cn1cc(Cc2cccc(OC(=O)C(C)(C)C)c2)cc(NC(=O)OCc2ccccc2)c1=O)C(=O)C(F)(F)F
: