Target
Neutrophil elastase
Ligand
BDBM50037109
Substrate
Meas. Tech.
ChEMBL_64139 (CHEMBL675303)
Ki
280±n/a nM
Citation
 Warner, PGreen, RCGomes, BStrimpler, AM Non-peptidic inhibitors of human leukocyte elastase. 1. The design and synthesis of pyridone-containing inhibitors. J Med Chem 37:3090-9 (1994)  
Target
Name:
Neutrophil elastase
Synonyms:
Bone marrow serine protease Coagulation factor X ELANE Elastase HLE Leukocyte elastase Medullasin Neutrophil elastase (HNE) PMN elastase Trypsin
Type:
Enzyme
Mol. Mass.:
28532.38
Organism:
Homo sapiens (Human)
Description:
P08246
Residue:
267
  
Inhibitor
Name:
BDBM50037109
Synonyms:
CHEMBL13684 | {2-Oxo-1-[(3,3,3-trifluoro-1-isopropyl-2-oxo-propylcarbamoyl)-methyl]-1,2-dihydro-pyridin-3-yl}-carbamic acid benzyl ester
Type:
Small organic molecule
Emp. Form.:
C21H22F3N3O5
Mol. Mass.:
453.4117
SMILES:
CC(C)C(NC(=O)Cn1cccc(NC(=O)OCc2ccccc2)c1=O)C(=O)C(F)(F)F
: