Target
Acetylcholinesterase
Ligand
BDBM50037142
Substrate
Meas. Tech.
ChEMBL_29233 (CHEMBL641567)
IC50
770±n/a nM
Citation
 Yamamoto, YIshihara, YKuntz, ID Docking analysis of a series of benzylamino acetylcholinesterase inhibitors with a phthalimide, benzoyl, or indanone moiety. J Med Chem 37:3141-53 (1994)  
Target
Name:
Acetylcholinesterase
Synonyms:
ACES_RAT Acetylcholinesterase and butyrylcholinesterase (AChE and BChE) Acetylcholinesterase, AChE | Ache
Type:
Enzyme
Mol. Mass.:
68193.62
Organism:
Rattus norvegicus (rat)
Description:
P37136
Residue:
614
  
Inhibitor
Name:
BDBM50037142
Synonyms:
2-[5-(Ethyl-phenethyl-amino)-pentyl]-5-nitro-isoindole-1,3-dione | CHEMBL110281
Type:
Small organic molecule
Emp. Form.:
C23H27N3O4
Mol. Mass.:
409.4782
SMILES:
CCN(CCCCCN1C(=O)c2ccc(cc2C1=O)[N+]([O-])=O)CCc1ccccc1
: