Target
Acetylcholinesterase
Ligand
BDBM50004031
Substrate
Meas. Tech.
ChEMBL_29233 (CHEMBL641567)
IC50
27000±n/a nM
Citation
 Yamamoto, YIshihara, YKuntz, ID Docking analysis of a series of benzylamino acetylcholinesterase inhibitors with a phthalimide, benzoyl, or indanone moiety. J Med Chem 37:3141-53 (1994)  
Target
Name:
Acetylcholinesterase
Synonyms:
ACES_RAT Acetylcholinesterase and butyrylcholinesterase (AChE and BChE) Acetylcholinesterase, AChE | Ache
Type:
Enzyme
Mol. Mass.:
68193.62
Organism:
Rattus norvegicus (rat)
Description:
P37136
Residue:
614
  
Inhibitor
Name:
BDBM50004031
Synonyms:
2-(1-Benzyl-piperidin-4-yl)-5-nitro-isoindole-1,3-dione CHEMBL419184
Type:
Small organic molecule
Emp. Form.:
C20H19N3O4
Mol. Mass.:
365.3826
SMILES:
[O-][N+](=O)c1ccc2C(=O)N(C3CCN(Cc4ccccc4)CC3)C(=O)c2c1
: