Target
Acetylcholinesterase
Ligand
BDBM50004040
Substrate
Meas. Tech.
ChEMBL_29233 (CHEMBL641567)
IC50
13±n/a nM
Citation
 Yamamoto, YIshihara, YKuntz, ID Docking analysis of a series of benzylamino acetylcholinesterase inhibitors with a phthalimide, benzoyl, or indanone moiety. J Med Chem 37:3141-53 (1994)  
Target
Name:
Acetylcholinesterase
Synonyms:
ACES_RAT Acetylcholinesterase and butyrylcholinesterase (AChE and BChE) Acetylcholinesterase, AChE | Ache
Type:
Enzyme
Mol. Mass.:
68193.62
Organism:
Rattus norvegicus (rat)
Description:
P37136
Residue:
614
  
Inhibitor
Name:
BDBM50004040
Synonyms:
2-(2-(1-benzylpiperidin-4-yl)ethyl)-5-nitroisoindoline-1,3-dione CHEMBL105874
Type:
Small organic molecule
Emp. Form.:
C22H23N3O4
Mol. Mass.:
393.4357
SMILES:
[O-][N+](=O)c1ccc2C(=O)N(CCC3CCN(Cc4ccccc4)CC3)C(=O)c2c1
: