Target
Chymotrypsin-C
Ligand
BDBM50037325
Substrate
Meas. Tech.
ChEMBL_49622 (CHEMBL660460)
Ki
500±n/a nM
Citation
 Damewood, JREdwards, PDFeeney, SGomes, BCSteelman, GBTuthill, PAWilliams, JCWarner, PWoolson, SAWolanin, DJ Nonpeptidic inhibitors of human leukocyte elastase. 2. Design, synthesis, and in vitro activity of a series of 3-amino-6-arylopyridin-2-one trifluoromethyl ketones. J Med Chem 37:3303-12 (1994)  
Target
Name:
Chymotrypsin-C
Synonyms:
CLCR CTRC_HUMAN Chymotrypsin Chymotrypsin-C
Type:
Enzyme
Mol. Mass.:
29487.98
Organism:
Homo sapiens (Human)
Description:
Q99895
Residue:
268
  
Inhibitor
Name:
BDBM50037325
Synonyms:
CHEMBL113261 | {6-(4-Chloro-phenyl)-2-oxo-1-[(3,3,3-trifluoro-1-isopropyl-2-oxo-propylcarbamoyl)-methyl]-1,2-dihydro-pyridin-3-yl}-carbamic acid benzyl ester
Type:
Small organic molecule
Emp. Form.:
C27H25ClF3N3O5
Mol. Mass.:
563.953
SMILES:
CC(C)C(NC(=O)Cn1c(ccc(NC(=O)OCc2ccccc2)c1=O)-c1ccc(Cl)cc1)C(=O)C(F)(F)F
: