Target
Neutrophil elastase
Ligand
BDBM50037331
Substrate
Meas. Tech.
ChEMBL_64134 (CHEMBL676742)
Ki
42±n/a nM
Citation
 Damewood, JREdwards, PDFeeney, SGomes, BCSteelman, GBTuthill, PAWilliams, JCWarner, PWoolson, SAWolanin, DJ Nonpeptidic inhibitors of human leukocyte elastase. 2. Design, synthesis, and in vitro activity of a series of 3-amino-6-arylopyridin-2-one trifluoromethyl ketones. J Med Chem 37:3303-12 (1994)  
Target
Name:
Neutrophil elastase
Synonyms:
Bone marrow serine protease Coagulation factor X ELANE Elastase HLE Leukocyte elastase Medullasin Neutrophil elastase (HNE) PMN elastase Trypsin
Type:
Enzyme
Mol. Mass.:
28532.38
Organism:
Homo sapiens (Human)
Description:
P08246
Residue:
267
  
Inhibitor
Name:
BDBM50037331
Synonyms:
4-{5-Benzyloxycarbonylamino-6-oxo-1-[(3,3,3-trifluoro-1-isopropyl-2-oxo-propylcarbamoyl)-methyl]-1,6-dihydro-pyridin-2-yl}-benzoic acid | CHEMBL322360
Type:
Small organic molecule
Emp. Form.:
C28H26F3N3O7
Mol. Mass.:
573.5171
SMILES:
CC(C)C(NC(=O)Cn1c(ccc(NC(=O)OCc2ccccc2)c1=O)-c1ccc(cc1)C(O)=O)C(=O)C(F)(F)F
: