Target
Neutrophil elastase
Ligand
BDBM50037339
Substrate
Meas. Tech.
ChEMBL_64134 (CHEMBL676742)
Ki
8.5±n/a nM
Citation
 Damewood, JREdwards, PDFeeney, SGomes, BCSteelman, GBTuthill, PAWilliams, JCWarner, PWoolson, SAWolanin, DJ Nonpeptidic inhibitors of human leukocyte elastase. 2. Design, synthesis, and in vitro activity of a series of 3-amino-6-arylopyridin-2-one trifluoromethyl ketones. J Med Chem 37:3303-12 (1994)  
Target
Name:
Neutrophil elastase
Synonyms:
Bone marrow serine protease Coagulation factor X ELANE Elastase HLE Leukocyte elastase Medullasin Neutrophil elastase (HNE) PMN elastase Trypsin
Type:
Enzyme
Mol. Mass.:
28532.38
Organism:
Homo sapiens (Human)
Description:
P08246
Residue:
267
  
Inhibitor
Name:
BDBM50037339
Synonyms:
CHEMBL113171 | {6-(4-Methoxy-phenyl)-2-oxo-1-[(3,3,3-trifluoro-1-isopropyl-2-oxo-propylcarbamoyl)-methyl]-1,2-dihydro-pyridin-3-yl}-carbamic acid benzyl ester
Type:
Small organic molecule
Emp. Form.:
C28H28F3N3O6
Mol. Mass.:
559.5336
SMILES:
COc1ccc(cc1)-c1ccc(NC(=O)OCc2ccccc2)c(=O)n1CC(=O)NC(C(C)C)C(=O)C(F)(F)F
: