Target
Neuropeptide FF receptor 2
Ligand
BDBM50037562
Substrate
Meas. Tech.
ChEMBL_143663 (CHEMBL755904)
Ki
20.9±n/a nM
Citation
 Gicquel, SMazarguil, HDesprat, CAllard, MDevillers, JPSimonnet, GZajac, JM Structure-activity study of neuropeptide FF: contribution of N-terminal regions to affinity and activity. J Med Chem 37:3477-81 (1994)  
Target
Name:
Neuropeptide FF receptor 2
Synonyms:
G-protein coupled receptor 74 NPFF2_RAT Npff2 Npgpr
Type:
Enzyme Catalytic Domain
Mol. Mass.:
47725.66
Organism:
RAT
Description:
NPFF2 0 RAT::Q9EQD2
Residue:
417
  
Inhibitor
Name:
BDBM50037562
Synonyms:
(S)-2-{[(S)-1-((S)-2-Amino-4-carbamoyl-butyryl)-pyrrolidine-2-carbonyl]-amino}-pentanedioic acid 5-amide 1-{[(S)-1-((S)-1-carbamoyl-2-phenyl-ethylcarbamoyl)-4-guanidino-butyl]-amide} | CHEMBL116185
Type:
Small organic molecule
Emp. Form.:
C30H47N11O7
Mol. Mass.:
673.7637
SMILES:
N[C@@H](CCC(N)=O)C(=O)N1CCC[C@H]1C(=O)N[C@@H](CCC(N)=O)C(=O)N[C@@H](CCCNC(N)=N)C(=O)N[C@@H](Cc1ccccc1)C(N)=O
: