Target
Prolyl endopeptidase
Ligand
BDBM50037606
Substrate
Meas. Tech.
ChEMBL_157477 (CHEMBL765796)
IC50
5.6±n/a nM
Citation
 Tsutsumi, SOkonogi, TShibahara, SOhuchi, SHatsushiba, EPatchett, AAChristensen, BG Synthesis and structure-activity relationships of peptidyl alpha-keto heterocycles as novel inhibitors of prolyl endopeptidase. J Med Chem 37:3492-502 (1994)  
Target
Name:
Prolyl endopeptidase
Synonyms:
3.4.21.26 PPCE_PIG Post-proline cleaving enzyme
Type:
Mol. Mass.:
80758.04
Organism:
Sus scrofa
Description:
Residue:
710
  
Inhibitor
Name:
BDBM50037606
Synonyms:
1-{(S)-2-[(S)-2-(Benzooxazole-2-carbonyl)-pyrrolidine-1-carbonyl]-pyrrolidin-1-yl}-4-phenyl-butan-1-one | CHEMBL324789
Type:
Small organic molecule
Emp. Form.:
C27H29N3O4
Mol. Mass.:
459.5369
SMILES:
O=C(CCCc1ccccc1)N1CCC[C@H]1C(=O)N1CCC[C@H]1C(=O)c1nc2ccccc2o1
: