Target
Muscarinic acetylcholine receptor M2
Ligand
BDBM50018056
Substrate
Meas. Tech.
ChEMBL_140105 (CHEMBL748286)
IC50
50±n/a nM
Citation
 Burke, BJDunn, WJHopfinger, AJ Construction of a molecular shape analysis-three-dimensional quantitative structure-analysis relationship for an analog series of pyridobenzodiazepinone inhibitors of muscarinic 2 and 3 receptors. J Med Chem 37:3775-88 (1994)  
Target
Name:
Muscarinic acetylcholine receptor M2
Synonyms:
ACM2_RAT Chrm-2 | Chrm2
Type:
Enzyme Catalytic Domain
Mol. Mass.:
51555.53
Organism:
RAT
Description:
P10980
Residue:
466
  
Inhibitor
Name:
BDBM50018056
Synonyms:
(AF-DX 116) 11-[2-(2-Diethylaminomethyl-piperidin-1-yl)-acetyl]-5,11-dihydro-benzo[e]pyrido[3,2-b][1,4]diazepin-6-one 2-Diethylaminomethyl-1-[2-oxo-2-(6-oxo-5,6-dihydro-benzo[e]pyrido[3,2-b][1,4]diazepin-11-yl)-ethyl]-piperidinium AF-DX 116 CHEMBL17045 | Otenzepad
Type:
Small organic molecule
Emp. Form.:
C24H31N5O2
Mol. Mass.:
421.5352
SMILES:
CCN(CC)CC1CCCCN1CC(=O)N1c2ccccc2C(=O)Nc2cccnc12
: