Target
Kappa-type opioid receptor
Ligand
BDBM50038019
Substrate
Meas. Tech.
ChEMBL_145805 (CHEMBL756072)
IC50
0.530000±n/a nM
Citation
 Meyer, JPCollins, NLung, FDDavis, PZalewska, TPorreca, FYamamura, HIHruby, VJ Design, synthesis, and biological properties of highly potent cyclic dynorphin A analogues. Analogues cyclized between positions 5 and 11. J Med Chem 37:3910-7 (1994)  
Target
Name:
Kappa-type opioid receptor
Synonyms:
Kappa Opioid Receptor OPRK1 Opiate Kappa 1 | mu/kappa opioid receptor
Type:
G Protein-Coupled Receptor (GPCR)
Mol. Mass.:
42744.99
Organism:
Cavia porcellus (domestic guinea pig)
Description:
P41144
Residue:
380
  
Inhibitor
Name:
BDBM50038019
Synonyms:
CHEMBL411338 | Tyr-Gly-Gly-Phe-D-Leu-Arg-Arg-Ile-Arg-Pro-Lys-NH2
Type:
Small organic molecule
Emp. Form.:
C63H104N22O12
Mol. Mass.:
1361.6401
SMILES:
CC[C@H](C)[C@H](NC(=O)[C@H](CCCNC(N)=N)NC(=O)[C@H](CCCNC(N)=N)NC(=O)[C@H](CC(C)C)NC(=O)[C@H](Cc1ccccc1)NC(=O)CNC(=O)CNC(=O)[C@@H](N)Cc1ccc(O)cc1)C(=O)N[C@@H](CCCNC(N)=N)C(=O)N1CCC[C@H]1C(=O)N[C@H](CCCCN)C(N)=O
: