Target
Histamine H3 receptor
Ligand
BDBM50492783
Substrate
Meas. Tech.
ChEMBL_975652 (CHEMBL2416136)
Ki
0.100000±n/a nM
Citation
 Levoin, NLabeeuw, OKrief, SCalmels, TPoupardin-Olivier, OBerrebi-Bertrand, ILecomte, JMSchwartz, JCCapet, M Determination of the binding mode and interacting amino-acids for dibasic H3 receptor antagonists. Bioorg Med Chem 21:4526-9 (2013)  
Target
Name:
Histamine H3 receptor
Synonyms:
G-protein coupled receptor 97 HH3R HRH3 Histamine H3 receptor (H3) Histamine receptor (H3 and H4)
Type:
G Protein-Coupled Receptor (GPCR)
Mol. Mass.:
48691.47
Organism:
Homo sapiens (Human)
Description:
Binding assays were using CHO cells stably expressing hH3R receptors.
Residue:
445
  
Inhibitor
Name:
BDBM50492783
Synonyms:
CHEMBL2413824
Type:
Small organic molecule
Emp. Form.:
C28H40N2O2
Mol. Mass.:
436.6294
SMILES:
C(COc1ccc(cc1)-c1ccc(OCCCN2CCCCC2)cc1)CN1CCCCC1
: