Target
Carbonic anhydrase 2
Ligand
BDBM26984
Substrate
Meas. Tech.
ChEMBL_975722 (CHEMBL2415220)
Ki
20000±n/a nM
Citation
 Pan, PVermelho, ABScozzafava, AParkkila, SCapasso, CSupuran, CT Anion inhibition studies of the ?-carbonic anhydrase from the protozoan pathogen Trypanosoma cruzi, the causative agent of Chagas disease. Bioorg Med Chem 21:4472-6 (2013)  
Target
Name:
Carbonic anhydrase 2
Synonyms:
CA-II CAC Carbonate dehydratase II Carbonic anhydrase 2 (CA-II) Carbonic anhydrase C Carbonic anhydrase II (CA-II) Carbonic anhydrase II (hCA II) | Carbonic anhydrase isoenzyme II (hCA II)
Type:
Enzyme
Mol. Mass.:
29250.71
Organism:
Homo sapiens (Human)
Description:
P00918
Residue:
260
  
Inhibitor
Name:
BDBM26984
Synonyms:
CHEMBL1644697 cyanide | iminomethanide
Type:
Ion
Emp. Form.:
CN
Mol. Mass.:
26.0179
SMILES:
[C-]#N
: