Target
Carbonic anhydrase 9
Ligand
BDBM50492477
Substrate
Meas. Tech.
ChEMBL_975780 (CHEMBL2415308)
Ki
0.450000±n/a nM
Citation
 Akdemir, AGüzel-Akdemir, OScozzafava, ACapasso, CSupuran, CT Inhibition of tumor-associated human carbonic anhydrase isozymes IX and XII by a new class of substituted-phenylacetamido aromatic sulfonamides. Bioorg Med Chem 21:5228-32 (2013)  
Target
Name:
Carbonic anhydrase 9
Synonyms:
CA-IX CAH9_HUMAN Carbonic anhydrase 9 (CA IX) Carbonic anhydrase 9 precursor Carbonic anhydrase IX (CAIX) Carbonic anhydrases; II & IX MN RCC-associated antigen G250
Type:
Enzyme
Mol. Mass.:
49669.03
Organism:
Homo sapiens (Human)
Description:
Catalytic domain of human cloned isozyme was used in the assay
Residue:
459
  
Inhibitor
Name:
BDBM50492477
Synonyms:
CHEMBL2402758
Type:
Small organic molecule
Emp. Form.:
C16H18N2O4S
Mol. Mass.:
334.39
SMILES:
COc1ccc(CC(=O)NCc2ccc(cc2)S(N)(=O)=O)cc1
: