Target
D(2) dopamine receptor
Ligand
BDBM50038279
Substrate
Meas. Tech.
ChEMBL_61343 (CHEMBL675959)
Ki
11±n/a nM
Citation
 Chumpradit, SKung, MPVessotskie, JFoulon, CMu, MKung, HF Iodinated 2-aminotetralins and 3-amino-1-benzopyrans: ligands for dopamine D2 and D3 receptors. J Med Chem 37:4245-50 (1995)  
Target
Name:
D(2) dopamine receptor
Synonyms:
D(2) dopamine receptor DOPAMINE D2 Long DRD2 Dopamine D2 receptor Dopamine D2 receptor (D2R) Dopamine2-like | d2
Type:
Cell-surface receptors
Mol. Mass.:
50647.10
Organism:
Homo sapiens (Human)
Description:
P14416
Residue:
443
  
Inhibitor
Name:
BDBM50038279
Synonyms:
3-[((E)-3-Iodo-allyl)-propyl-amino]-chroman-8-ol | CHEMBL133085
Type:
Small organic molecule
Emp. Form.:
C15H20INO2
Mol. Mass.:
373.2293
SMILES:
CCCN(C\C=C\I)C1COc2c(O)cccc2C1
: