Target
D(3) dopamine receptor
Ligand
BDBM50038276
Substrate
Meas. Tech.
ChEMBL_62935 (CHEMBL673840)
Ki
1.85±n/a nM
Citation
 Chumpradit, SKung, MPVessotskie, JFoulon, CMu, MKung, HF Iodinated 2-aminotetralins and 3-amino-1-benzopyrans: ligands for dopamine D2 and D3 receptors. J Med Chem 37:4245-50 (1995)  
Target
Name:
D(3) dopamine receptor
Synonyms:
DOPAMINE D3 DRD3_HUMAN Dopamine D3 receptor (D3) Dopamine receptor Dopamine receptor D3
Type:
Mol. Mass.:
44243.43
Organism:
Homo sapiens (Human)
Description:
Residue:
400
  
Inhibitor
Name:
BDBM50038276
Synonyms:
(R,S) 7-[(3-Iodo-allyl)-propyl-amino]-5,6,7,8-tetrahydro-naphthalen-2-ol 7-[(3-Iodo-allyl)-propyl-amino]-5,6,7,8-tetrahydro-naphthalen-2-ol | CHEMBL110239
Type:
Small organic molecule
Emp. Form.:
C16H22INO
Mol. Mass.:
371.2565
SMILES:
CCCN(C\C=C\I)C1CCc2ccc(O)cc2C1
: