Target
D(2) dopamine receptor
Ligand
BDBM50038280
Substrate
Meas. Tech.
ChEMBL_61343 (CHEMBL675959)
Ki
9.7±n/a nM
Citation
 Chumpradit, SKung, MPVessotskie, JFoulon, CMu, MKung, HF Iodinated 2-aminotetralins and 3-amino-1-benzopyrans: ligands for dopamine D2 and D3 receptors. J Med Chem 37:4245-50 (1995)  
Target
Name:
D(2) dopamine receptor
Synonyms:
D(2) dopamine receptor DOPAMINE D2 Long DRD2 Dopamine D2 receptor Dopamine D2 receptor (D2R) Dopamine2-like | d2
Type:
Cell-surface receptors
Mol. Mass.:
50647.10
Organism:
Homo sapiens (Human)
Description:
P14416
Residue:
443
  
Inhibitor
Name:
BDBM50038280
Synonyms:
6-[((E)-3-Iodo-allyl)-propyl-amino]-5,6,7,8-tetrahydro-naphthalen-2-ol | CHEMBL336851
Type:
Small organic molecule
Emp. Form.:
C16H22INO
Mol. Mass.:
371.2565
SMILES:
CCCN(C\C=C\I)C1CCc2cc(O)ccc2C1
: