Target
Acetylcholine receptor subunit alpha/beta/delta/gamma
Ligand
BDBM50038416
Substrate
Meas. Tech.
ChEMBL_223059 (CHEMBL841530)
Kd
1800±n/a nM
Citation
 Gu, YLee, HHudson, RA Bis-catechol-substituted redox-reactive analogues of hexamethonium and decamethonium: stimulated affinity-dependent reactivity through iron peroxide catalysis. J Med Chem 37:4417-20 (1995)  
Target
Name:
Acetylcholine receptor subunit alpha/beta/delta/gamma
Synonyms:
Acetylcholine receptor | Acetylcholine receptor protein alpha/beta/delta/gamma chain
Type:
Mol. Mass.:
Description:
ASSAY_ID of EBI is 143080
Components:
This complex has 4 components.
Component 1
Name:
Acetylcholine receptor subunit beta
Synonyms:
ACHB_TETCF CHRNB1
Type:
PROTEIN
Mol. Mass.:
56146.98
Organism:
Torpedo californica
Description:
EBI_19626
Residue:
493
  
Component 2
Name:
Acetylcholine receptor subunit gamma
Synonyms:
ACHG_TETCF CHRNG
Type:
PROTEIN
Mol. Mass.:
58151.68
Organism:
Torpedo californica
Description:
EBI_19662
Residue:
506
  
Component 3
Name:
Acetylcholine receptor subunit alpha
Synonyms:
ACHA_TETCF Acetylcholine receptor protein alpha chain | CHRNA1
Type:
PROTEIN
Mol. Mass.:
52735.09
Organism:
Torpedo californica
Description:
ChEMBL_216981
Residue:
461
  
Component 4
Name:
Acetylcholine receptor subunit delta
Synonyms:
ACHD_TETCF Acetylcholine receptor protein delta chain | chrnd
Type:
PROTEIN
Mol. Mass.:
59885.01
Organism:
Torpedo californica
Description:
ChEMBL_142744
Residue:
522
  
Inhibitor
Name:
BDBM50038416
Synonyms:
(1,6-trimethyl ammonium)hexane; dibromide CHEMBL332524 HEXAMETHONIUM BROMIDE Hexamethoniumdibromide N,N,N,N'',N'',N''-Hexamethylhexane-1,6-diammoniumdibromide
Type:
Small organic molecule
Emp. Form.:
C12H30N2
Mol. Mass.:
202.3789
SMILES:
C[N+](C)(C)CCCCCC[N+](C)(C)C
: