Target
Vasopressin V1a receptor
Ligand
BDBM50038601
Substrate
Meas. Tech.
ChEMBL_215170 (CHEMBL821343)
Ki
0.470±n/a nM
Citation
 Carnazzi, EAumelas, ABarberis, CGuillon, GSeyer, R A new series of photoactivatable and iodinatable linear vasopressin antagonists. J Med Chem 37:1841-9 (1994)  
Target
Name:
Vasopressin V1a receptor
Synonyms:
Avpr1a VASOPRESSIN V1A Vasopressin V1a receptor | Vasopressin receptor
Type:
Enzyme Catalytic Domain
Mol. Mass.:
47674.81
Organism:
RAT
Description:
VASOPRESSIN V1A AVPR1A RAT::P30560
Residue:
424
  
Inhibitor
Name:
BDBM50038601
Synonyms:
4-N3-C6H4CH2CH2CO-D-Tyr(Me)-Phe-Gln-Asn-Arg-Pro-Arg-Tyr(I)-NH2 CHEMBL424905
Type:
Small organic molecule
Emp. Form.:
C63H84N20O13
Mol. Mass.:
1329.4673
SMILES:
CN([C@@H](Cc1ccc(O)cc1)C(=O)N[C@@H](Cc1ccccc1)C(=O)N[C@@H](CCC(N)=O)C(=O)N[C@@H](CC(N)=O)C(=O)N[C@@H](CCCNC(N)=N)C(=O)N1CCC[C@H]1C(=O)N[C@@H](CCCNC(N)=N)C(=O)N[C@@H](Cc1ccc(O)cc1)C(N)=O)C(=O)CCc1ccc(cc1)N=[N+]=[N-]
: