Target
Carbonic anhydrase 2
Ligand
BDBM50038960
Substrate
Meas. Tech.
ChEMBL_45051 (CHEMBL658049)
Kd
21±n/a nM
Citation
 Jain, AWhitesides, GMAlexander, RSChristianson, DW Identification of two hydrophobic patches in the active-site cavity of human carbonic anhydrase II by solution-phase and solid-state studies and their use in the development of tight-binding inhibitors. J Med Chem 37:2100-5 (1994)  
Target
Name:
Carbonic anhydrase 2
Synonyms:
CA-II CAC Carbonate dehydratase II Carbonic anhydrase 2 (CA-II) Carbonic anhydrase C Carbonic anhydrase II (CA-II) Carbonic anhydrase II (hCA II) | Carbonic anhydrase isoenzyme II (hCA II)
Type:
Enzyme
Mol. Mass.:
29250.71
Organism:
Homo sapiens (Human)
Description:
P00918
Residue:
260
  
Inhibitor
Name:
BDBM50038960
Synonyms:
CHEMBL302587 | {2-[(S)-3-Phenyl-2-(4-sulfamoyl-benzoylamino)-propionylamino]-acetylamino}-acetic acid
Type:
Small organic molecule
Emp. Form.:
C20H22N4O7S
Mol. Mass.:
462.476
SMILES:
NS(=O)(=O)c1ccc(cc1)C(=O)N[C@@H](Cc1ccccc1)C(=O)NCC(=O)NCC(O)=O
: