Target
cGMP-specific 3',5'-cyclic phosphodiesterase
Ligand
BDBM50039000
Substrate
Meas. Tech.
ChEMBL_155842 (CHEMBL768661)
IC50
2700±n/a nM
Citation
 Takase, YSaeki, TWatanabe, NAdachi, HSouda, SSaito, I Cyclic GMP phosphodiesterase inhibitors. 2. Requirement of 6-substitution of quinazoline derivatives for potent and selective inhibitory activity. J Med Chem 37:2106-11 (1994)  
Target
Name:
cGMP-specific 3',5'-cyclic phosphodiesterase
Synonyms:
3',5'-cyclic phosphodiesterase PDE5 PDE5A_HUMAN Phosphodiesterase 5 (PDE5) Phosphodiesterase 5A (PDE5A) cGMP-specific 3',5'-cyclic phosphodiesterase
Type:
Protein
Mol. Mass.:
99975.83
Organism:
Homo sapiens (Human)
Description:
O76074
Residue:
875
  
Inhibitor
Name:
BDBM50039000
Synonyms:
CHEMBL304277 | {4-[(Benzo[1,3]dioxol-5-ylmethyl)-amino]-quinazolin-6-yl}-morpholin-4-yl-methanone
Type:
Small organic molecule
Emp. Form.:
C21H20N4O4
Mol. Mass.:
392.4079
SMILES:
O=C(N1CCOCC1)c1ccc2ncnc(NCc3ccc4OCOc4c3)c2c1
: