Target
Acetylcholinesterase
Ligand
BDBM50039208
Substrate
Meas. Tech.
ChEMBL_29232 (CHEMBL641566)
IC50
812.0±n/a nM
Citation
 Ishihara, YHirai, KMiyamoto, MGoto, G Central cholinergic agents. 6. Synthesis and evaluation of 3-[1-(phenylmethyl)-4-piperidinyl]-1-(2,3,4,5-tetrahydro-1H-1-benzazepi n-8-yl)-1-propanones and their analogs as central selective acetylcholinesterase inhibitors. J Med Chem 37:2292-9 (1994)  
Target
Name:
Acetylcholinesterase
Synonyms:
ACES_RAT Acetylcholinesterase and butyrylcholinesterase (AChE and BChE) Acetylcholinesterase, AChE | Ache
Type:
Enzyme
Mol. Mass.:
68193.62
Organism:
Rattus norvegicus (rat)
Description:
P37136
Residue:
614
  
Inhibitor
Name:
BDBM50039208
Synonyms:
1-(2,3-Dihydro-1H-indol-5-yl)-3-[1-(2-methoxy-benzyl)-piperidin-4-yl]-propan-1-one CHEMBL306776
Type:
Small organic molecule
Emp. Form.:
C24H30N2O2
Mol. Mass.:
378.5072
SMILES:
COc1ccccc1CN1CCC(CCC(=O)c2ccc3NCCc3c2)CC1
: